All phases MPI install Test build Test run
Date range:
Hardware:
OS:
MPI name:
MPI version:
Configure arguments:
Compiler:
Bitness:
Endian:
Org:
Local username:
Platform name:
[Reset form]  [Start over]        [Preferences]  [Advanced]
Current time (GMT):2014-10-01 22:17:08
Date range (GMT): 2013-09-20 11:43:14 - 2013-10-04 11:43:14
Phase(s):MPI install  (Via Direct Access)
Result:Fail only
Number of rows:1
Absolute date range:Create permalink

#
1
Trial
f
Date range
2013-09-24 09:41:32
Org
absoft
Platform name
Fortran_13.0_32_CentOS5.5
Hardware
 ia32
OS
 Linux
MPI name
ompi-nightly-trunk
MPI version
1.9a1r29227
Bitness
32
Endian
unknown
Compiler
absoft
Vpath mode
00
Compiler version
GCC: 4.1.2, Absoft: Absoft 32-bit Pro Fortran 13.0.3
Configure arguments
FC=af90 FCFLAGS=-Z790 "CFLAGS=-g -pipe" --enable-picky --enable-debug
--enable-mpirun-prefix-by-default
Description
Absoft MPI test compilations
Exit value
2
Signal
-1
Duration
00:19:05
Client serial
800885
Result message
"make all -j 8" failed -- skipping this build.
Stdout
--- make all -j 8 result_stdout ---
   CC       shmem_quiet_f.lo
   CC       shmem_fence_f.lo
   CCLD     libshmem_fortran.la
 make[2]: Leaving directory
`/home/ompitest/scratches/2013-09-24/mpi-install/xAAD/src/openmpi-1.9a1r29227/oshmem/shmem/fortran'
 Making all in mca/atomic
 make[2]: Entering directory
`/home/ompitest/scratches/2013-09-24/mpi-install/xAAD/src/openmpi-1.9a1r29227/oshmem/mca/atomic'
   CC       base/atomic_base_frame.lo
   CC       base/atomic_base_available.lo
   CC       base/atomic_base_select.lo
   CCLD     libmca_atomic.la
 make[2]: Leaving directory
`/home/ompitest/scratches/2013-09-24/mpi-install/xAAD/src/openmpi-1.9a1r29227/oshmem/mca/atomic'
 Making all in mca/memheap
 make[2]: Entering directory
`/home/ompitest/scratches/2013-09-24/mpi-install/xAAD/src/openmpi-1.9a1r29227/oshmem/mca/memheap'
   CC       base/memheap_base_frame.lo
   CC       base/memheap_base_select.lo
   CC       base/memheap_base_static.lo
   CC       base/memheap_base_register.lo
   CC       base/memheap_base_alloc.lo
   CC       base/memheap_base_mkey.lo
   CCLD     libmca_memheap.la
 make[2]: Leaving directory
`/home/ompitest/scratches/2013-09-24/mpi-install/xAAD/src/openmpi-1.9a1r29227/oshmem/mca/memheap'
 Making all in mca/scoll
 make[2]: Entering directory
`/home/ompitest/scratches/2013-09-24/mpi-install/xAAD/src/openmpi-1.9a1r29227/oshmem/mca/scoll'
   CC       base/scoll_base_frame.lo
   CC       base/scoll_base_available.lo
   CC       base/scoll_base_select.lo
   CCLD     libmca_scoll.la
 make[2]: Leaving directory
`/home/ompitest/scratches/2013-09-24/mpi-install/xAAD/src/openmpi-1.9a1r29227/oshmem/mca/scoll'
 Making all in mca/spml
 make[2]: Entering directory
`/home/ompitest/scratches/2013-09-24/mpi-install/xAAD/src/openmpi-1.9a1r29227/oshmem/mca/spml'
   CC       base/spml_base_frame.lo
   CC       base/spml_base_select.lo
   CC       base/spml_base_atomicreq.lo
   CC       base/spml_base_request.lo
   CC       base/spml_base_getreq.lo
   CC       base/spml_base_putreq.lo
   CC       base/spml_base.lo
   CCLD     libmca_spml.la
 make[2]: Leaving directory
`/home/ompitest/scratches/2013-09-24/mpi-install/xAAD/src/openmpi-1.9a1r29227/oshmem/mca/spml'
 Making all in .
 make[2]: Entering directory
`/home/ompitest/scratches/2013-09-24/mpi-install/xAAD/src/openmpi-1.9a1r29227/oshmem'
   CC       op/op.lo
   CC       proc/proc.lo
   CC       request/request.lo
   CC       proc/proc_group_cache.lo
   CC       runtime/oshmem_shmem_init.lo
   CC       runtime/oshmem_shmem_finalize.lo
   CC       runtime/oshmem_shmem_abort.lo
   CC       runtime/oshmem_shmem_params.lo
 make[2]: Leaving directory
`/home/ompitest/scratches/2013-09-24/mpi-install/xAAD/src/openmpi-1.9a1r29227/oshmem'
 make[1]: Leaving directory
`/home/ompitest/scratches/2013-09-24/mpi-install/xAAD/src/openmpi-1.9a1r29227/oshmem'
Stderr
--- make all -j 8 result_stderr ---
 in .libs/constants.o is smaller  than 32 in  .libs/mpi-f08.o
/usr/bin /ld: Warning: alignment 4  of symbol `ompi_f08_mpi_logical4' in .libs /constants.o is
smaller than 32  in .libs/mpi-f08.o
/usr /bin/ld: Warning: alignment  4 of symbol `ompi_f08_mpi_logical8' in  .libs/constants.o is
smaller than  32 in .libs/mpi-f08.o 
 btl_sm.c: In function 'mca_btl_sm_dump': 
 btl_sm.c:1244: warning: format '%lu' expects type 'long unsigned int', but argument 3 has type
'size_t' 
 btl_sm.c:1244: warning: format '%lu' expects type 'long unsigned int', but argument 5 has type
'size_t' 
 coll_tuned_dynamic_rules.c: In function 'ompi_coll_tuned_dump_msg_rule': 
 coll_tuned_dynamic_rules.c:111: warning: format '%10lu' expects type 'long unsigned int', but
argument 3 has type 'size_t' 
 coll_ml_lex.c: In function 'yy_get_next_buffer':
 coll_ml_lex.c:1265: warning: comparison between signed and unsigned
 coll_sm_module.c: In function 'bootstrap_comm': 
 coll_sm_module.c:578: warning: format '%lu' expects type 'long unsigned int', but argument 6 has
type 'size_t' 
 fcoll_dynamic_file_read_all.c: In function 'mca_fcoll_dynamic_file_read_all': 
 fcoll_dynamic_file_read_all.c:591: warning: cast to pointer from integer of different size 
 fcoll_dynamic_file_read_all.c:606: warning: cast to pointer from integer of different size 
 io_ompio.c: In function 'ompi_io_ompio_generate_current_file_view': 
 io_ompio.c:249: warning: cast from pointer to integer of different size 
 ad_coll_exch_new.c: In function 'ADIOI_Print_flatlist_node': 
 ad_coll_exch_new.c:52: warning: ISO C does not support the '%Ld' printf format 
 ad_coll_exch_new.c:52: warning: ISO C does not support the '%Ld' printf format 
 ad_coll_exch_new.c:56: warning: ISO C does not support the '%Ld' printf format 
 ad_coll_exch_new.c:56: warning: ISO C does not support the '%Ld' printf format 
 malloc.c: In function 'ADIOI_Malloc_fn': 
 malloc.c:57: warning: ISO C90 does not support the 'z' printf length modifier 
 pml_ob1.c: In function 'mca_pml_ob1_dump_frag_list': 
 pml_ob1.c:525: warning: format '%lu' expects type 'long unsigned int', but argument 7 has type
'size_t' 
 pml_ob1.c: In function 'mca_pml_ob1_dump': 
 pml_ob1.c:542: warning: format '%lu' expects type 'long unsigned int', but argument 8 has type
'size_t' 
 pml_ob1.c:542: warning: format '%lu' expects type 'long unsigned int', but argument 9 has type
'size_t' 
 sharedfp_individual_insert_metadata.c: In function 'mca_sharedfp_individual_write_metadata_file':
 sharedfp_individual_insert_metadata.c:120: warning: format '%ld' expects type 'long int', but
argument 2 has type 'unsigned int'
 op/op.c: In function 'oshmem_op_max_freal16_func':
 op/op.c:194: error: 'a' undeclared (first use in this function)
op/op.c:194: error: (Each undeclared identifier is reported only once 
 op/op.c:194: error: for each function it appears in.)
 op/op.c:194: error: expected expression before ')' token 
 op/op.c:194: error: 'b' undeclared (first use in this function) 
 op/op.c:194: error: expected expression before ')' token 
 op/op.c: In function 'oshmem_op_min_freal16_func':
 op/op.c:211: error: 'a' undeclared (first use in this function) 
op/op.c:211: error: expected expression before ')' token
 op/op.c:211: error: 'b' undeclared (first use in this function)
op/op.c:211: error: expected expression before ')' token
 op/op.c: In function 'oshmem_op_sum_freal16_func': 
op/op.c:230: error: 'a' undeclared (first use in this function)
 op/op.c:230: error: expected expression before ')' token
op/op.c:230: error: 'b' undeclared (first use in this function)
op/op.c:230: error: expected expression before ')' token
 op/op.c: In function 'oshmem_op_prod_freal16_func': 
op/op.c:249: error: 'a' undeclared (first use in this function)
 op/op.c:249: error: expected expression before ')' token
op/op.c:249: error: 'b' undeclared (first use in this function)
op/op.c:249: error: expected expression before ')' token
 op/op.c: In function 'oshmem_op_init': 
op/op.c:302: error: expected expression before ')' token
 op/op.c:318: error: expected expression before ')' token 
 op/op.c:336: error: expected expression before ')' token 
 op/op.c:354: error: expected expression before ')' token 
 make[2]:  *** [op/op.lo] Error 1 
 make[2]:  *** Waiting for unfinished jobs.... 
 make[1]:  *** [all-recursive] Error 1
 make:  *** [all-recursive] Error 1
Environment



Time: 1.017 sec. (PHP: 0.018 / SQL: 1)

Overall MTT contribution graph (updated nightly): All Time or 1 Year Window